[pjsip] Build Error on MacOS

Lucas Rosa Galêgo lrgalego at gmail.com
Tue Aug 11 20:50:27 EDT 2009


Hi folks,
I just checkout the 1.x release from subversion and try a new fresh build
into a mac system.
I'm having the follow error:

../src/pjsip-ua/sip_timer.c:65: error: redefinition of typedef ‘pjsip_timer’
../include/pjsip-ua/sip_timer.h:49: error: previous declaration of
‘pjsip_timer’ was here
../src/pjsip-ua/sip_timer.c: In function ‘pjsip_timer_process_resp’:
../src/pjsip-ua/sip_timer.c:778: warning: label
‘TODO___CHECK_IF_REMOTE_SUPPORT_UPDATE’ defined but not used
make[2]: *** [output/pjsip-ua-i386-apple-darwin9.8.0/sip_timer.o] Error 1
make[1]: *** [pjsip-ua] Error 2
make: *** [all] Error 1

anyone knows what this could be?

Thanks in advance.
-------------- next part --------------
An HTML attachment was scrubbed...
URL: <http://lists.pjsip.org/pipermail/pjsip_lists.pjsip.org/attachments/20090811/074ea457/attachment.html>


More information about the pjsip mailing list