[pjsip] Build Error on MacOS

Nanang Izzuddin nanang at pjsip.org
Wed Aug 12 09:00:04 EDT 2009


Hi,

A patch for this issue has just been checked-in to SVN trunk in r2865.
Thanks for the report.

Just FYI, the problem is related to Session Timer extension which is
currently under development and tests. Test reports and feedbacks will
be very appreciated.

BR
nanang


On Wed, Aug 12, 2009 at 7:50 AM, Lucas Rosa Galêgo<lrgalego at gmail.com> wrote:
> Hi folks,
> I just checkout the 1.x release from subversion and try a new fresh build
> into a mac system.
> I'm having the follow error:
> ../src/pjsip-ua/sip_timer.c:65: error: redefinition of typedef ‘pjsip_timer’
> ../include/pjsip-ua/sip_timer.h:49: error: previous declaration of
> ‘pjsip_timer’ was here
> ../src/pjsip-ua/sip_timer.c: In function ‘pjsip_timer_process_resp’:
> ../src/pjsip-ua/sip_timer.c:778: warning: label
> ‘TODO___CHECK_IF_REMOTE_SUPPORT_UPDATE’ defined but not used
> make[2]: *** [output/pjsip-ua-i386-apple-darwin9.8.0/sip_timer.o] Error 1
> make[1]: *** [pjsip-ua] Error 2
> make: *** [all] Error 1
> anyone knows what this could be?
> Thanks in advance.
> _______________________________________________
> Visit our blog: http://blog.pjsip.org
>
> pjsip mailing list
> pjsip at lists.pjsip.org
> http://lists.pjsip.org/mailman/listinfo/pjsip_lists.pjsip.org
>
>




More information about the pjsip mailing list